BDBM8284 3-[methyl(phenyl)amino]-4-(3-nitrophenyl)-2,5-dihydro-1H-pyrrole-2,5-dione::4-arylmaleimide deriv. 7c
SMILES CN(C1=C(C(=O)NC1=O)c1cccc(c1)N(=O)=O)c1ccccc1
InChI Key InChIKey=NPACVUDPISMSSR-UHFFFAOYSA-N
Data  1 IC50
  Tab Delimited (TSV)   2D SDfile   Computed 3D by Vconf -m prep SDfile
Find this compound or compounds like it in BindingDB:
Activity Spreadsheet -- Enzyme Inhibition Constant Data from BindingDB
Found 1 hit for monomerid = 8284
TargetGlycogen synthase kinase-3 alpha(Homo sapiens (Human))
Smithkline Beecham Pharmaceuticals
LigandPNGBDBM8284(3-[methyl(phenyl)amino]-4-(3-nitrophenyl)-2,5-dihy...)
Affinity DataIC50:  1.40E+3nMpH: 7.0 T: 2°C. Assay description: The biochemical activity of compounds was determined by incubation with specific enzyme and substrate in the presence 10 uM ATP/ [gamma-33P] ATP. Aft...
In DepthDetails ArticlePubMed